Target
Epidermal growth factor receptor
Ligand
BDBM505890
Substrate
Meas. Tech.
High Throughput Biochemical Assay
IC50
1.000±n/a nM
Citation
 Bacon, EMBalan, GChou, CClark, CTCottell, JJKim, MKirschberg, TALink, JOPhillips, GSchroeder, SDSquires, NHStevens, KLTaylor, JGWatkins, WJWright, NEZipfel, SM Cot modulators and methods of use thereof US Patent  US11066414 Publication Date 7/20/2021 
Target
Name:
Epidermal growth factor receptor
Synonyms:
EGF Receptor Substrate EGFR_HUMAN ERBB1 Epidermal Growth Factor Receptor erbB-1 Epidermal growth factor receptor (EGFR) HER1 Proto-oncogene c-ErbB-1 Tyrosine-Protein Kinase ErbB-1
Type:
Receptor Kinase Domain
Mol. Mass.:
134279.59
Organism:
Homo sapiens (Human)
Description:
P00533
Residue:
1210
  
Inhibitor
Name:
BDBM505890
Synonyms:
8-chloro-6-(((S)-(1-(1-(difluoromethyl)- cyclopropyl)-1H-1,2,3-triazol-4-yl)(6- fluoro-2-methylpyridin-3-yl)methyl)- amino)-4-(((R)-3,3-dimethyltetrahydro- 2H-pyran-4-yl)amino)quinoline-3- carbonitrile | US11066414, Compound 539
Type:
Small organic molecule
Emp. Form.:
C30H32ClF3N8O
Mol. Mass.:
613.076
SMILES:
Cc1nc(F)ccc1[C@H](Nc1cc(Cl)c2ncc(C#N)c(N[C@@H]3CCOCC3(C)C)c2c1)C1=CN(NN1)C1(CC1)C(F)F
: