Target
Epidermal growth factor receptor
Ligand
BDBM505928
Substrate
Meas. Tech.
High Throughput Biochemical Assay
IC50
1.000±n/a nM
Citation
 Bacon, EMBalan, GChou, CClark, CTCottell, JJKim, MKirschberg, TALink, JOPhillips, GSchroeder, SDSquires, NHStevens, KLTaylor, JGWatkins, WJWright, NEZipfel, SM Cot modulators and methods of use thereof US Patent  US11066414 Publication Date 7/20/2021 
Target
Name:
Epidermal growth factor receptor
Synonyms:
EGF Receptor Substrate EGFR_HUMAN ERBB1 Epidermal Growth Factor Receptor erbB-1 Epidermal growth factor receptor (EGFR) HER1 Proto-oncogene c-ErbB-1 Tyrosine-Protein Kinase ErbB-1
Type:
Receptor Kinase Domain
Mol. Mass.:
134279.59
Organism:
Homo sapiens (Human)
Description:
P00533
Residue:
1210
  
Inhibitor
Name:
BDBM505928
Synonyms:
(S)-6-(((1-(1-cyanocyclopropyl)-1H- 1,2,3-triazol-4-yl)(quinolin-5- yl)methyl)amino)-4-(neopentylamino)- quinoline-3,8-dicarbonitrile | US11066414, Compound 577
Type:
Small organic molecule
Emp. Form.:
C32H30N10
Mol. Mass.:
554.6476
SMILES:
CC(C)(C)CNc1c(cnc2c(cc(N[C@H](C3=CN(NN3)C3(CC3)C#N)c3cccc4ncccc34)cc12)C#N)C#N
: