Target
Epidermal growth factor receptor
Ligand
BDBM506055
Substrate
Meas. Tech.
High Throughput Biochemical Assay
IC50
1.000±n/a nM
Citation
 Bacon, EMBalan, GChou, CClark, CTCottell, JJKim, MKirschberg, TALink, JOPhillips, GSchroeder, SDSquires, NHStevens, KLTaylor, JGWatkins, WJWright, NEZipfel, SM Cot modulators and methods of use thereof US Patent  US11066414 Publication Date 7/20/2021 
Target
Name:
Epidermal growth factor receptor
Synonyms:
EGF Receptor Substrate EGFR_HUMAN ERBB1 Epidermal Growth Factor Receptor erbB-1 Epidermal growth factor receptor (EGFR) HER1 Proto-oncogene c-ErbB-1 Tyrosine-Protein Kinase ErbB-1
Type:
Receptor Kinase Domain
Mol. Mass.:
134279.59
Organism:
Homo sapiens (Human)
Description:
P00533
Residue:
1210
  
Inhibitor
Name:
BDBM506055
Synonyms:
6-(((SHH(1S,2S)-2- fluorocyclopropyl)-1H-1,2,3- triazol-4-yl)(isoquinolin-5- yl)methyl)amino)-4- (neopentylamino)quinoline-3,8- dicarbonitrile | US11066414, Compound 704
Type:
Small organic molecule
Emp. Form.:
C31H30FN9
Mol. Mass.:
547.6286
SMILES:
CC(C)(C)CNc1c(cnc2c(cc(N[C@H](C3=CN(NN3)C3C[C@@H]3F)c3cccc4cnccc34)cc12)C#N)C#N
: