Target
Menin
Ligand
BDBM506353
Substrate
Meas. Tech.
Menin Binding Affinity
IC50
4.00±n/a nM
Citation
 Wang, SAguilar, AXu, SHuang, LStuckey, JXu, T Piperidines as covalent menin inhibitors US Patent  US11045448 Publication Date 6/29/2021 
Target
Name:
Menin
Synonyms:
MEN1 Menin/Histone-lysine N-methyltransferase MLL | SCG2
Type:
Protein
Mol. Mass.:
68022.55
Organism:
Homo sapiens (Human)
Description:
O00255
Residue:
615
  
Inhibitor
Name:
BDBM506353
Synonyms:
US11045448, Cpd. No. 62 | methyl ((1S,2R)-2-((S)-(1-((1-(4-((3-((E)-but-2- enamido)phenyl)sulfonyl)phenyl)azetidin-3- yl)methyl)piperidin-4-yl)(cyano)(3- fluorophenyl)methyl)cyclopentyl)carbamate
Type:
Small organic molecule
Emp. Form.:
C40H46FN5O5S
Mol. Mass.:
727.887
SMILES:
COC(=O)N[C@H]1CCC[C@@H]1[C@@](C#N)(C1CCN(CC2CN(C2)c2ccc(cc2)S(=O)(=O)c2cccc(NC(=O)\C=C\C)c2)CC1)c1cccc(F)c1
: