Target
Menin
Ligand
BDBM506359
Substrate
Meas. Tech.
Menin Binding Affinity
IC50
7.00±n/a nM
Citation
 Wang, SAguilar, AXu, SHuang, LStuckey, JXu, T Piperidines as covalent menin inhibitors US Patent  US11045448 Publication Date 6/29/2021 
Target
Name:
Menin
Synonyms:
MEN1 Menin/Histone-lysine N-methyltransferase MLL | SCG2
Type:
Protein
Mol. Mass.:
68022.55
Organism:
Homo sapiens (Human)
Description:
O00255
Residue:
615
  
Inhibitor
Name:
BDBM506359
Synonyms:
US11045448, Cpd. No. 68 | methyl ((1S,2R)-2-((S)-cyano(1-(3-(4-((1-((E)-4-(dimethylamino)but- 2-enoyl)azetidin-3-yl)sulfonyl)phenoxy)propyl)piperidin-4-yl)(3- fluorophenyl)methyl)cyclopentyl)carbamate
Type:
Small organic molecule
Emp. Form.:
C38H50FN5O6S
Mol. Mass.:
723.897
SMILES:
COC(=O)N[C@H]1CCC[C@@H]1[C@@](C#N)(C1CCN(CCCOc2ccc(cc2)S(=O)(=O)C2CN(C2)C(=O)\C=C\CN(C)C)CC1)c1cccc(F)c1
: