Target
Somatostatin receptor type 4
Ligand
BDBM506428
Substrate
Meas. Tech.
SSTR4 I-125 Somatostatin Competition Binding Assay
IC50
20.0±n/a nM
Citation
 Cheruvallath, ZGreen, JJohnson, BSchleicher, KSun, HTang, M Piperidinyl-3-(aryloxy)propanamides and propanoates US Patent  US11045457 Publication Date 6/29/2021 
Target
Name:
Somatostatin receptor type 4
Synonyms:
SOMATOSTATIN SST4 SS4-R SSR4_HUMAN SSTR4 | Somatostatin receptor type 4 (SSTR4)
Type:
Enzyme
Mol. Mass.:
42015.38
Organism:
Homo sapiens (Human)
Description:
P31391
Residue:
388
  
Inhibitor
Name:
BDBM506428
Synonyms:
US11045457, Example 28
Type:
Small organic molecule
Emp. Form.:
C21H28F3N5O2
Mol. Mass.:
439.4745
SMILES:
CN1C[C@@H](NC(=O)C(C)(C)COc2ncccc2C(F)(F)F)[C@@H](C1)c1cnn(C)c1C
: