Target
Somatostatin receptor type 4
Ligand
BDBM506606
Substrate
Meas. Tech.
SSTR4 I-125 Somatostatin Competition Binding Assay
IC50
25.1±n/a nM
Citation
 Cheruvallath, ZGreen, JJohnson, BSchleicher, KSun, HTang, M Piperidinyl-3-(aryloxy)propanamides and propanoates US Patent  US11045457 Publication Date 6/29/2021 
Target
Name:
Somatostatin receptor type 4
Synonyms:
SOMATOSTATIN SST4 SS4-R SSR4_HUMAN SSTR4 | Somatostatin receptor type 4 (SSTR4)
Type:
Enzyme
Mol. Mass.:
42015.38
Organism:
Homo sapiens (Human)
Description:
P31391
Residue:
388
  
Inhibitor
Name:
BDBM506606
Synonyms:
US11045457, Example 207
Type:
Small organic molecule
Emp. Form.:
C14H15F6N3O3
Mol. Mass.:
387.2776
SMILES:
F[C@H]1CNCC[C@@H]1NC(=O)C(F)(F)COc1ncccc1OC(F)(F)F
: