Target
Sphingosine 1-phosphate receptor 3
Ligand
BDBM506621
Substrate
Meas. Tech.
Receptor [35S] GTPgammaS Binding Assays
EC50
>60000±n/a nM
Citation
 Dyckman, AJLi, LGilmore, JL Alkylphenyl compounds US Patent  US11046646 Publication Date 6/29/2021 
Target
Name:
Sphingosine 1-phosphate receptor 3
Synonyms:
C9orf108 EDG3 S1P receptor 3 S1P3 S1PR3_HUMAN Sphingosine 1-phosphate receptor 3 (S1P3) | Sphingosine 1-phosphate receptor Edg-3
Type:
G Protein-Coupled Receptor (GPCR)
Mol. Mass.:
42278.13
Organism:
Homo sapiens (Human)
Description:
Q99500
Residue:
378
  
Inhibitor
Name:
BDBM506621
Synonyms:
US11046646, Example 18
Type:
Small organic molecule
Emp. Form.:
C19H31N2O5P
Mol. Mass.:
398.4336
SMILES:
CCCCCCCCc1ccc(cc1)N1CCC(N)(COP(O)(O)=O)C1=O
: