Target
Indoleamine 2,3-dioxygenase 1
Ligand
BDBM506627
Substrate
Meas. Tech.
IDO1 Cell-Based Assay
IC50
472±n/a nM
Citation
 Lewis, RTHamilton, MJones, PPetrocchi, AReyna, NMcAfoos, TCross, JBSoth, MJ Compounds useful as inhibitors of indoleamine 2,3-dioxygenase and/or tryptophan dioxygenase US Patent  US11046649 Publication Date 6/29/2021 
Target
Name:
Indoleamine 2,3-dioxygenase 1
Synonyms:
I23O1_HUMAN IDO-1 INDO Indoleamine 2,3-dioxygenase | Indoleamine-pyrrole 2,3-dioxygenase
Type:
Enzyme
Mol. Mass.:
45330.80
Organism:
Homo sapiens (Human)
Description:
P14902
Residue:
403
  
Inhibitor
Name:
BDBM506627
Synonyms:
US11046649, Ex. 5
Type:
Small organic molecule
Emp. Form.:
C22H19ClF5N3
Mol. Mass.:
455.851
SMILES:
Fc1cc2ncn([C@@H]3C[C@H]4[C@H](CNC(c5ccc(Cl)cc5)C(F)(F)F)[C@H]4C3)c2cc1F
: