Target
Indoleamine 2,3-dioxygenase 1
Ligand
BDBM506631
Substrate
Meas. Tech.
IDO1 Cell-Based Assay
IC50
55.0±n/a nM
Citation
 Lewis, RTHamilton, MJones, PPetrocchi, AReyna, NMcAfoos, TCross, JBSoth, MJ Compounds useful as inhibitors of indoleamine 2,3-dioxygenase and/or tryptophan dioxygenase US Patent  US11046649 Publication Date 6/29/2021 
Target
Name:
Indoleamine 2,3-dioxygenase 1
Synonyms:
I23O1_HUMAN IDO-1 INDO Indoleamine 2,3-dioxygenase | Indoleamine-pyrrole 2,3-dioxygenase
Type:
Enzyme
Mol. Mass.:
45330.80
Organism:
Homo sapiens (Human)
Description:
P14902
Residue:
403
  
Inhibitor
Name:
BDBM506631
Synonyms:
US11046649, Ex. 9
Type:
Small organic molecule
Emp. Form.:
C25H29FN2O3
Mol. Mass.:
424.5078
SMILES:
CC([C@@H]1[C@H]2C[C@@H](C[C@@H]12)Oc1ccnc2ccc(F)cc12)C(=O)NC12CC(CCO)(C1)C2
: