Target
Indoleamine 2,3-dioxygenase 1
Ligand
BDBM506642
Substrate
Meas. Tech.
IDO1 Cell-Based Assay
IC50
6.10±n/a nM
Citation
 Lewis, RTHamilton, MJones, PPetrocchi, AReyna, NMcAfoos, TCross, JBSoth, MJ Compounds useful as inhibitors of indoleamine 2,3-dioxygenase and/or tryptophan dioxygenase US Patent  US11046649 Publication Date 6/29/2021 
Target
Name:
Indoleamine 2,3-dioxygenase 1
Synonyms:
I23O1_HUMAN IDO-1 INDO Indoleamine 2,3-dioxygenase | Indoleamine-pyrrole 2,3-dioxygenase
Type:
Enzyme
Mol. Mass.:
45330.80
Organism:
Homo sapiens (Human)
Description:
P14902
Residue:
403
  
Inhibitor
Name:
BDBM506642
Synonyms:
2-((1R,3s,5S,6r)-3-(5,6- difluoro-1H-benzo[d]- imidazol-1-yl)bicyclo- [3.1.0]hexan-6-yl)-N-(6- methoxypyridin-3-yl)- propanamide | US11046649, Ex. 20
Type:
Small organic molecule
Emp. Form.:
C22H22F2N4O2
Mol. Mass.:
412.4325
SMILES:
COc1ccc(NC(=O)C(C)[C@@H]2[C@H]3C[C@@H](C[C@@H]23)n2cnc3cc(F)c(F)cc23)cn1
: