Target
Indoleamine 2,3-dioxygenase 1
Ligand
BDBM506660
Substrate
Meas. Tech.
IDO1 Cell-Based Assay
IC50
1.37±n/a nM
Citation
 Lewis, RTHamilton, MJones, PPetrocchi, AReyna, NMcAfoos, TCross, JBSoth, MJ Compounds useful as inhibitors of indoleamine 2,3-dioxygenase and/or tryptophan dioxygenase US Patent  US11046649 Publication Date 6/29/2021 
Target
Name:
Indoleamine 2,3-dioxygenase 1
Synonyms:
I23O1_HUMAN IDO-1 INDO Indoleamine 2,3-dioxygenase | Indoleamine-pyrrole 2,3-dioxygenase
Type:
Enzyme
Mol. Mass.:
45330.80
Organism:
Homo sapiens (Human)
Description:
P14902
Residue:
403
  
Inhibitor
Name:
BDBM506660
Synonyms:
4-chloro-N-((R)-cyclo- propyl((1R,3s,5S,6r)-3-((6- fluoroquinolin-4-yl)oxy)- bicyclo[3.1.0]hexan-6-yl)- methyl)benzamide | US11046649, Ex. 38
Type:
Small organic molecule
Emp. Form.:
C26H24ClFN2O2
Mol. Mass.:
450.932
SMILES:
Fc1ccc2nccc(O[C@H]3C[C@H]4[C@@H](C3)[C@@H]4[C@H](NC(=O)c3ccc(Cl)cc3)C3CC3)c2c1
: