Target
Indoleamine 2,3-dioxygenase 1
Ligand
BDBM506706
Substrate
Meas. Tech.
IDO1 Cell-Based Assay
IC50
303±n/a nM
Citation
 Lewis, RTHamilton, MJones, PPetrocchi, AReyna, NMcAfoos, TCross, JBSoth, MJ Compounds useful as inhibitors of indoleamine 2,3-dioxygenase and/or tryptophan dioxygenase US Patent  US11046649 Publication Date 6/29/2021 
Target
Name:
Indoleamine 2,3-dioxygenase 1
Synonyms:
I23O1_HUMAN IDO-1 INDO Indoleamine 2,3-dioxygenase | Indoleamine-pyrrole 2,3-dioxygenase
Type:
Enzyme
Mol. Mass.:
45330.80
Organism:
Homo sapiens (Human)
Description:
P14902
Residue:
403
  
Inhibitor
Name:
BDBM506706
Synonyms:
(S)-N-(4-(5-chloropyridin- 2-yl)phenyl)-2- ((1R,3R,5S,6r)-3-(5,6- difluoro-1H-benzo[d]- imidazol-1-yl)bicyclo- [3.1.0]hexan-6-yl)- propanamide | US11046649, Ex. 84
Type:
Small organic molecule
Emp. Form.:
C27H23ClF2N4O
Mol. Mass.:
492.948
SMILES:
C[C@@H]([C@@H]1[C@H]2C[C@@H](C[C@@H]12)n1cnc2cc(F)c(F)cc12)C(=O)Nc1ccc(cc1)-c1ccc(Cl)cn1
: