Target
Histamine H1 receptor
Ligand
BDBM506791
Substrate
Meas. Tech.
H1 and 5-HT2A Binding Assay
Ki
>50±n/a nM
Citation
 Duggan, MEEdgar, DM Piperazine substituted azapine derivatives and uses thereof US Patent  US11046651 Publication Date 6/29/2021 
Target
Name:
Histamine H1 receptor
Synonyms:
H1R HISTAMINE H1 HRH1_HUMAN
Type:
G Protein-Coupled Receptor (GPCR)
Mol. Mass.:
55808.72
Organism:
Homo sapiens (Human)
Description:
Cell pellets from SK-N-MC cells transfected with human H1 receptor were used in binding assay.
Residue:
487
  
Inhibitor
Name:
BDBM506791
Synonyms:
US11046651, Compound 37
Type:
Small organic molecule
Emp. Form.:
C23H26FN3O2
Mol. Mass.:
395.4698
SMILES:
CC(C)(CN1CCN(CC1)C1=Nc2ccccc2Cc2cc(F)ccc12)C(O)=O
: