Target
5-hydroxytryptamine receptor 2A
Ligand
BDBM506773
Substrate
Meas. Tech.
H1 and 5-HT2A Binding Assay
Ki
13±n/a nM
Citation
 Duggan, MEEdgar, DM Piperazine substituted azapine derivatives and uses thereof US Patent  US11046651 Publication Date 6/29/2021 
Target
Name:
5-hydroxytryptamine receptor 2A
Synonyms:
5-HT-2 5-HT2A 5-hydroxytryptamine receptor 2A (5HT-2A) 5HT2A_HUMAN HTR2A | Serotonin receptor 2A
Type:
undefined
Mol. Mass.:
52607.65
Organism:
Homo sapiens (Human)
Description:
P28223
Residue:
471
  
Inhibitor
Name:
BDBM506773
Synonyms:
US11046651, Compound 13
Type:
Small organic molecule
Emp. Form.:
C23H24ClN3O3
Mol. Mass.:
425.908
SMILES:
Cc1ccc2c(Oc3cc(Cl)ccc3N=C2N2CCN(CC3(CC3)C(O)=O)CC2)c1
: