Target
5-hydroxytryptamine receptor 2C
Ligand
BDBM506772
Substrate
Meas. Tech.
5-HT2C Binding Assay
Ki
>50±n/a nM
Citation
 Duggan, MEEdgar, DM Piperazine substituted azapine derivatives and uses thereof US Patent  US11046651 Publication Date 6/29/2021 
Target
Name:
5-hydroxytryptamine receptor 2C
Synonyms:
5-HT-2C 5-HT2C-INI 5-HTR2C 5-hydroxytryptamine receptor 2C (5-HT-2C) 5HT-1C HTR1C Serotonin (5-HT3) receptor Serotonin Receptor 2C
Type:
G Protein-Coupled Receptor (GPCR)
Mol. Mass.:
51836.79
Organism:
Homo sapiens (Human)
Description:
P28335
Residue:
458
  
Inhibitor
Name:
BDBM506772
Synonyms:
US11046651, Compound 1
Type:
Small organic molecule
Emp. Form.:
C23H26ClN3O3
Mol. Mass.:
427.924
SMILES:
Cc1ccc2c(Oc3cc(Cl)ccc3N=C2N2CCN(CC(C)(C)C(O)=O)CC2)c1
: