Target
D(2) dopamine receptor
Ligand
BDBM506806
Substrate
Meas. Tech.
D2 binding assay
Ki
2874±n/a nM
Citation
 Duggan, MEEdgar, DM Piperazine substituted azapine derivatives and uses thereof US Patent  US11046651 Publication Date 6/29/2021 
Target
Name:
D(2) dopamine receptor
Synonyms:
D(2) dopamine receptor DOPAMINE D2 Long DRD2 Dopamine D2 receptor Dopamine D2 receptor (D2R) Dopamine2-like | d2
Type:
Cell-surface receptors
Mol. Mass.:
50647.10
Organism:
Homo sapiens (Human)
Description:
P14416
Residue:
443
  
Inhibitor
Name:
BDBM506806
Synonyms:
3-(4-(dibenzo[b,f][1,4]oxazepin-11-yl)piperazin-1-yl)-2,2-dimethylpropanoic acid | US11046651, Compound A-5
Type:
Small organic molecule
Emp. Form.:
C23H26N2O3
Mol. Mass.:
378.4641
SMILES:
CC(C)(CN1CCC(CC1)C1=Nc2ccccc2Oc2ccccc12)C(O)=O
: