Target
Botulinum neurotoxin type A [1-429]
Ligand
BDBM506810
Substrate
Meas. Tech.
BoNT/A LC429 Enzymatic assay
Ki
13.8±n/a nM
Citation
 Jiao, GJohnson, ATO''Malley, SKim, SJ Hydroxamic acids comprising pyrazole moiety and uses thereof US Patent  US11046652 Publication Date 6/29/2021 
Target
Name:
Botulinum neurotoxin type A [1-429]
Synonyms:
BXA1_CLOBH Botulinum neurotoxin type A botA
Type:
Enzyme Catalytic Domain
Mol. Mass.:
49198.33
Organism:
Clostridium botulinum (strain Hall / ATCC 3502 / NCTC 13319 / Type A)
Description:
P0DPI1[1-429] First 11 removed
Residue:
429
  
Inhibitor
Name:
BDBM506810
Synonyms:
US11046652, Example 1-4
Type:
Small organic molecule
Emp. Form.:
C17H22ClN3O3
Mol. Mass.:
351.828
SMILES:
CCn1nccc1[C@@H](Cc1ccc(Cl)cc1)[C@@H](CC(=O)NO)OC
: