BDBM101209 US8524917, 182
SMILES CO\N=C(/C)c1ccc2c(C(=O)NCc3ccc(F)c(F)c3)c(C(C)C)n(Cc3ccccc3)c2c1
InChI Key InChIKey=AGCSCYUABDUONY-HNSNBQBZSA-N
Data  1 IC50
  Tab Delimited (TSV)   2D SDfile   Computed 3D by Vconf -m prep SDfile
Find this compound or compounds like it in BindingDB:
Activity Spreadsheet -- Enzyme Inhibition Constant Data from BindingDB
Found 1 hit for monomerid = 101209
TargetSphingosine 1-phosphate receptor 3(Homo sapiens (Human))
Allergan
US Patent
LigandPNGBDBM101209(US8524917, 182)
Affinity DataIC50:  147nM. Assay description: Inhibition assay using sphingosine-1-phosphate receptor 3.
In DepthDetails US Patent