BDBM1020 5-cyano-N-(3-{1-[4-hydroxy-2-oxo-6-(2-phenylethyl)-6-propyl-5,6-dihydro-2H-pyran-3-yl]-2,2-dimethylpropyl}phenyl)pyridine-2-sulfonamide::N-(3-[1-(5,6-Dihydro-4-hydroxy-2-oxo-6-phenethyl-6-propyl-2H-pyran-3-yl)-2,2-dimethylpropyl]phenyl)-5-cycano-2-pyridinesulfonamide::Tipranavir deriv. 35
SMILES CCCC1(CCc2ccccc2)CC(=O)C(C(c2cccc(NS(=O)(=O)c3ccc(cn3)C#N)c2)C(C)(C)C)C(=O)O1
InChI Key InChIKey=AIUXBBCXEURFNG-UHFFFAOYSA-N
Data  1 KI
  Tab Delimited (TSV)   2D SDfile   Computed 3D by Vconf -m prep SDfile
Find this compound or compounds like it in BindingDB:
Activity Spreadsheet -- Enzyme Inhibition Constant Data from BindingDB
Found 1 hit for monomerid = 1020
TargetDimer of Gag-Pol polyprotein [489-587](Human immunodeficiency virus type 1)
Upjohn
LigandPNGBDBM1020(5-cyano-N-(3-{1-[4-hydroxy-2-oxo-6-(2-phenylethyl)...)
Affinity DataKi:  1.90nM ΔG°:  -11.8kcal/molepH: 5.0 T: 2°C. Assay description: HIV-1 protease was purified and refolded from E. coli inclusion bodies. The substrate used spans the p17-p24 processing site (R-V-S-Q-N-Y-P-I-V-Q-N-K...
In DepthDetails ArticlePubMed