BDBM103154 US8541407, 131
SMILES C(N1CCC(CC1)c1nnc([nH]1)-c1ccncc1)c1ccc(cc1)-c1nnc2-c3ccccc3Nc3ncccc3-n12
InChI Key InChIKey=FJCWCPHHVCAGJJ-UHFFFAOYSA-N
Data  1 IC50
  Tab Delimited (TSV)   2D SDfile   Computed 3D by Vconf -m prep SDfile
Find this compound or compounds like it in BindingDB:
Activity Spreadsheet -- Enzyme Inhibition Constant Data from BindingDB
Found 1 hit for monomerid = 103154
TargetRAC-alpha serine/threonine-protein kinase(Homo sapiens (Human))
Arqule
US Patent
LigandPNGBDBM103154(US8541407, 131)
Affinity DataIC50:  170nM. Assay description: Biochemical assay using Akt AlphaScreen (Amplified Luminescent Proximity Homogeneous Assay) technology.
In DepthDetails US Patent