BDBM103188 US8541407, 165
SMILES Fc1ccc(NC(=O)NC2CCN(Cc3ccc(cc3)-c3nnc4-c5ccccc5Nc5ncccc5-n34)CC2)cc1
InChI Key InChIKey=MGXIGLLTWMPQBT-UHFFFAOYSA-N
Data  1 IC50
  Tab Delimited (TSV)   2D SDfile   Computed 3D by Vconf -m prep SDfile
Find this compound or compounds like it in BindingDB:
Activity Spreadsheet -- Enzyme Inhibition Constant Data from BindingDB
Found 1 hit for monomerid = 103188
TargetRAC-alpha serine/threonine-protein kinase(Homo sapiens (Human))
Arqule
US Patent
LigandPNGBDBM103188(US8541407, 165)
Affinity DataIC50:  330nM. Assay description: Biochemical assay using Akt AlphaScreen (Amplified Luminescent Proximity Homogeneous Assay) technology.
In DepthDetails US Patent