BDBM103229 US8541407, 206
SMILES Cc1cc(no1)C(=O)NC1(CCC1)c1ccc(cc1)-c1nnc2-c3ccccc3Nc3ncccc3-n12
InChI Key InChIKey=VVBKSFFNJZNKDL-UHFFFAOYSA-N
Data  1 IC50
  Tab Delimited (TSV)   2D SDfile   Computed 3D by Vconf -m prep SDfile
Find this compound or compounds like it in BindingDB:
Activity Spreadsheet -- Enzyme Inhibition Constant Data from BindingDB
Found 1 hit for monomerid = 103229
TargetRAC-alpha serine/threonine-protein kinase(Homo sapiens (Human))
Arqule
US Patent
LigandPNGBDBM103229(US8541407, 206)
Affinity DataIC50:  240nM. Assay description: Biochemical assay using Akt AlphaScreen (Amplified Luminescent Proximity Homogeneous Assay) technology.
In DepthDetails US Patent