BDBM103315 US8552199, 1-31
SMILES CN([C@@H]1Cc2ccc(CN3CCC3)cc2C1)C(=O)c1ccc(OCC2CC2)cc1
InChI Key InChIKey=JAGBHRSJYBEXGT-HSZRJFAPSA-N
Data  1 IC50
  Tab Delimited (TSV)   2D SDfile   Computed 3D by Vconf -m prep SDfile
Find this compound or compounds like it in BindingDB:
Activity Spreadsheet -- Enzyme Inhibition Constant Data from BindingDB
Found 1 hit for monomerid = 103315
TargetMelanin-concentrating hormone receptor 1(Homo sapiens (Human))
Sanofi
US Patent
LigandPNGBDBM103315(US8552199, 1-31)
Affinity DataIC50:  111nM. Assay description: Calcium mobilization assay using MCHR1.
In DepthDetails US Patent