BDBM103331 US8552199, 1-90
SMILES O=C1N(CCc2cc(OC[C@@H]3CCCO3)ccc12)[C@@H]1Cc2ccc(CNC3CCCCC3)cc2C1
InChI Key InChIKey=FCEXHPXYQMLRKJ-IAPPQJPRSA-N
Data  1 IC50
  Tab Delimited (TSV)   2D SDfile   Computed 3D by Vconf -m prep SDfile
Find this compound or compounds like it in BindingDB:
Activity Spreadsheet -- Enzyme Inhibition Constant Data from BindingDB
Found 1 hit for monomerid = 103331
TargetMelanin-concentrating hormone receptor 1(Homo sapiens (Human))
Sanofi
US Patent
LigandPNGBDBM103331(US8552199, 1-90)
Affinity DataIC50:  777nM. Assay description: Calcium mobilization assay using MCHR1.
In DepthDetails US Patent