BDBM103445 US8552037, 92
SMILES CCC(=O)NCCC1CCc2ccc3nc(C)oc3c12
InChI Key InChIKey=JROBZLKCLLSHNV-UHFFFAOYSA-N
Data  2 KI  2 IC50
  Tab Delimited (TSV)   2D SDfile   Computed 3D by Vconf -m prep SDfile
Find this compound or compounds like it in BindingDB:
Activity Spreadsheet -- Enzyme Inhibition Constant Data from BindingDB
Found 4 hits for monomerid = 103445
TargetMelatonin receptor type 1A(Homo sapiens (Human))
Takeda Pharmaceutical
Curated by ChEMBL
LigandPNGBDBM103445(US8552037, 92)
Affinity DataKi:  0.0670nM. Assay description: Displacement of 2-[125l]-lodomelatonin from human MT1 expressed in CHO cell membrane incubated for 150 mins by radioligand binding assay
In DepthDetails ArticlePubMed
TargetMelatonin receptor type 1B(Homo sapiens (Human))
Takeda Pharmaceutical
Curated by ChEMBL
LigandPNGBDBM103445(US8552037, 92)
Affinity DataKi:  0.0880nM. Assay description: Displacement of 2-[125l]-lodomelatonin from human MT2 expressed in CHO cell membrane incubated for 150 mins by radioligand binding assay
In DepthDetails ArticlePubMed
TargetMelatonin receptor type 1A(Homo sapiens (Human))
Takeda Pharmaceutical
Curated by ChEMBL
LigandPNGBDBM103445(US8552037, 92)
Affinity DataIC50:  0.130nM. Assay description: Binding assay using melatonin receptors 1 or 2.
In DepthDetails US Patent
TargetMelatonin receptor type 1B(Homo sapiens (Human))
Takeda Pharmaceutical
Curated by ChEMBL
LigandPNGBDBM103445(US8552037, 92)
Affinity DataIC50:  0.280nM. Assay description: Binding assay using melatonin receptors 1 or 2.
In DepthDetails US Patent