BDBM104346 US8575186, 109
SMILES CCn1cc(c2ccccc12)S(=O)(=O)c1ccc2n(C)c3CC4CCC(N4)c3c2c1
InChI Key InChIKey=AGCNVMQBGLWVOV-UHFFFAOYSA-N
Data  1 KI
  Tab Delimited (TSV)   2D SDfile   Computed 3D by Vconf -m prep SDfile
Find this compound or compounds like it in BindingDB:
Activity Spreadsheet -- Enzyme Inhibition Constant Data from BindingDB
Found 1 hit for monomerid = 104346
Target5-hydroxytryptamine receptor 6(Homo sapiens (Human))
Albany Molecular Research
US Patent
LigandPNGBDBM104346(US8575186, 109)
Affinity DataKi:  0.720nM. Assay description: The relative affinities of the various compounds for the 5-HT6 receptor were measured in a radioligand binding assay, using a sintillation proximity ...
In DepthDetails US Patent