BDBM104477 US8575186, 240/241::US8575186, 257
SMILES COc1cc(cc2c3C4CCC(Cc3n(C)c12)N4)S(=O)(=O)n1ccc2ccccc12
InChI Key InChIKey=MYAKLRIXBOSQBL-UHFFFAOYSA-N
Data  2 KI
  Tab Delimited (TSV)   2D SDfile   Computed 3D by Vconf -m prep SDfile
Find this compound or compounds like it in BindingDB:
Activity Spreadsheet -- Enzyme Inhibition Constant Data from BindingDB
Found 2 hits for monomerid = 104477
Target5-hydroxytryptamine receptor 6(Homo sapiens (Human))
Albany Molecular Research
US Patent
LigandPNGBDBM104477(US8575186, 240/241 | US8575186, 257)
Affinity DataKi:  0.350nM. Assay description: The relative affinities of the various compounds for the 5-HT6 receptor were measured in a radioligand binding assay, using a sintillation proximity ...
In DepthDetails US Patent
Target5-hydroxytryptamine receptor 6(Homo sapiens (Human))
Albany Molecular Research
US Patent
LigandPNGBDBM104477(US8575186, 240/241 | US8575186, 257)
Affinity DataKi:  0.850nM. Assay description: The relative affinities of the various compounds for the 5-HT6 receptor were measured in a radioligand binding assay, using a sintillation proximity ...
In DepthDetails US Patent