BDBM10606 (-)-(5R)-5-Methyl-4,5-dihydro-2,5-methano-1,3-benzodioxepin-7-yl N-(o-Tolyl)-carbamate::(1R)-1-methyl-8,10-dioxatricyclo[7.2.1.0^{2,7}]dodeca-2,4,6-trien-4-yl N-(2-methylphenyl)carbamate::Benzodioxepine Carbamate 12b
SMILES Cc1ccccc1NC(=O)Oc1ccc2OC3C[C@@](C)(CO3)c2c1
InChI Key InChIKey=MBYLQCWDOYEQRA-NNBQYGFHSA-N
Data  1 IC50
  Tab Delimited (TSV)   2D SDfile   Computed 3D by Vconf -m prep SDfile
Find this compound or compounds like it in BindingDB:
Activity Spreadsheet -- Enzyme Inhibition Constant Data from BindingDB
Found 1 hit for monomerid = 10606
TargetAcetylcholinesterase(Homo sapiens (Human))
National Institutes Of Health
LigandPNGBDBM10606((-)-(5R)-5-Methyl-4,5-dihydro-2,5-methano-1,3-benz...)
Affinity DataIC50:  97nMpH: 8.0 T: 2°C. Assay description: The cholinesterase assays were performed using colorimetric method reported by Ellman. The absorbance changes at 412 nm were recorded for 5 min with ...
In DepthDetails ArticlePubMed