BDBM109201 US8604028, 57
SMILES CC1=NC(C(F)F)=C(C#N)C(C1[N+]#[C-])c1cc2c(N)nccc2o1
InChI Key InChIKey=IGOZHMVYVXYCSV-UHFFFAOYSA-N
Data  1 IC50
  Tab Delimited (TSV)   2D SDfile   Computed 3D by Vconf -m prep SDfile
Find this compound or compounds like it in BindingDB:
Activity Spreadsheet -- Enzyme Inhibition Constant Data from BindingDB
Found 1 hit for monomerid = 109201
TargetHepatocyte growth factor receptor(Homo sapiens (Human))
Bayer Intellectual Property
US Patent
LigandPNGBDBM109201(US8604028, 57)
Affinity DataIC50:  37nMpH: 7.0 T: 2°C. Assay description: Tyrosine kinase activity assay (NADH Read-Out)using human c-Met protein (Invitrogen, Carlsbad, Calif., USA). The amount of phosphorylated substrate ...
In DepthDetails US Patent