BDBM109589 US8609715, A-9
SMILES CC(Cc1ccc(o1)C(=O)Oc1ccc(cc1)C(N)=N)C(=O)N(CCCO)CC(O)=O
InChI Key InChIKey=UWJTXKREKAAFAE-UHFFFAOYSA-N
Data  2 KI
  Tab Delimited (TSV)   2D SDfile   Computed 3D by Vconf -m prep SDfile
Find this compound or compounds like it in BindingDB:
Activity Spreadsheet -- Enzyme Inhibition Constant Data from BindingDB
Found 2 hits for monomerid = 109589
TargetEnteropeptidase(Homo sapiens (Human))
Ajinomoto
US Patent
LigandPNGBDBM109589(US8609715, A-9)
Affinity DataKi:  3.17nM. Assay description: Inhibition assay using human enteropeptidase.
In DepthDetails US Patent
TargetSerine protease 1(Homo sapiens (Human))
Ajinomoto
US Patent
LigandPNGBDBM109589(US8609715, A-9)
Affinity DataKi:  7.32nM. Assay description: Inhibition assay using human trysin.
In DepthDetails US Patent