BDBM109791 US8618299, 9
SMILES Cn1c2C3CCCCN3CCc2c2ccc(cc12)-n1ccc(cc1=O)-c1ccc(Cl)cn1
InChI Key InChIKey=JAODYBYNSCOYFY-UHFFFAOYSA-N
Data  1 KI
  Tab Delimited (TSV)   2D SDfile   Computed 3D by Vconf -m prep SDfile
Find this compound or compounds like it in BindingDB:
Activity Spreadsheet -- Enzyme Inhibition Constant Data from BindingDB
Found 1 hit for monomerid = 109791
TargetMelanin-concentrating hormone receptor 1(Homo sapiens (Human))
Albany Molecular Research
US Patent
LigandPNGBDBM109791(US8618299, 9)
Affinity DataKi:  1.75E+3nM. Assay description: Evaluation of the affinity of compounds for the human MCH-1 receptor was accomplished using 4-(3,4,5-tritritiumbenzyloxy)-1-(1-(2-(pyrrolidin-1-yl)et...
In DepthDetails US Patent