BDBM112614 US8618103, I-110
SMILES CC(C)CS(=O)(=O)N1CCC[C@@H](C1)Nc1nc(ncc1-c1cnc2[nH]ccc2n1)N1CCN(C)CC1
InChI Key InChIKey=UVWWSVLFELMDEN-SFHVURJKSA-N
Data  1 KI  2 IC50
  Tab Delimited (TSV)   2D SDfile   Computed 3D by Vconf -m prep SDfile
Find this compound or compounds like it in BindingDB:
Activity Spreadsheet -- Enzyme Inhibition Constant Data from BindingDB
Found 2 hits for monomerid = 112614
TargetTyrosine-protein kinase JAK3(Homo sapiens (Human))
Hoffmann-La Roche
US Patent
LigandPNGBDBM112614(US8618103, I-110)
Affinity DataKi:  0.00337nM IC50:  0.00675nMpH: 7.2Assay Description:The kinase activity of all three JAK kinases is measured using a radioactive, end-point assay and with trace amounts of 33P-ATP.
In DepthDetails US Patent
TargetTyrosine-protein kinase JAK2(Homo sapiens (Human))
Hoffmann-La Roche
US Patent
LigandPNGBDBM112614(US8618103, I-110)
Affinity DataIC50:  0.0585nMpH: 7.2Assay Description:The kinase activity of all three JAK kinases is measured using a radioactive, end-point assay and with trace amounts of 33P-ATP.
In DepthDetails US Patent