BDBM119459 US8680120, 9-35
SMILES COc1ccc2n(Cc3cccc(n3)C(O)=O)c(cc2c1)-c1ccsc1
InChI Key InChIKey=HZELXPSZKJJBLK-UHFFFAOYSA-N
Data  1 IC50
  Tab Delimited (TSV)   2D SDfile   Computed 3D by Vconf -m prep SDfile
Find this compound or compounds like it in BindingDB:
Activity Spreadsheet -- Enzyme Inhibition Constant Data from BindingDB
Found 1 hit for monomerid = 119459
TargetProstaglandin E2 receptor EP1 subtype(Rattus norvegicus (Rat))
Kissei Pharmaceutical
US Patent
LigandPNGBDBM119459(US8680120, 9-35)
Affinity DataIC50:  23nM. Assay description: The rat EP1 receptor-expressing cells were washed with the assay buffer. 100 μL of a fluorescent calcium indicator (Fluo-4 NW Calcium Assay Kit ...
In DepthDetails US Patent