BDBM121129 A457::US8722896, (+/-)-1-Benzyl-N-(9-chloro-3,4- dihydro-2H-1,5-benzodioxepin- 7-ylmethyl)-N- isobutylpyrrolidine-3- carboxamide
SMILES CC(C)CN(Cc1cc(Cl)c2OCCCOc2c1)C(=O)C1CCN(Cc2ccccc2)C1
InChI Key InChIKey=IOXBZEKQVLIIQH-UHFFFAOYSA-N
Data  2 KI  2 IC50  1 EC50
  Tab Delimited (TSV)   2D SDfile   Computed 3D by Vconf -m prep SDfile
Find this compound or compounds like it in BindingDB:
Activity Spreadsheet -- Enzyme Inhibition Constant Data from BindingDB
Found 2 hits for monomerid = 121129
TargetProkineticin receptor 2(Homo sapiens (Human))
Central South University
LigandPNGBDBM121129(A457 | US8722896, (+/-)-1-Benzyl-N-(9-chloro-3,4- ...)
Affinity DataIC50:  102nMpH: 7.5 T: 2°C. Assay description: Briefly, Chinese hamster ovary cells stably expressing the photoprotein aequorin were transiently transfected with WT or respective mutant PKR2-expre...
In DepthDetails ArticlePubMed
TargetProkineticin-2(Homo sapiens (Human))
Central South University
LigandPNGBDBM121129(A457 | US8722896, (+/-)-1-Benzyl-N-(9-chloro-3,4- ...)
Affinity DataIC50:  40nM EC50:  7.80nMpH: 7.5 T: 2°C. Assay description: Briefly, Chinese hamster ovary cells stably expressing the photoprotein aequorin were transiently transfected with WT or respective mutant PKR2-expre...
In DepthDetails ArticlePubMed