BDBM123070 US8742115, 9
SMILES Cc1cc(cc(NC(=O)[C@H]2CCC(=O)N2C2CCN(Cc3ccc(Cl)c(C)c3)CC2)n1)C(=O)N1CCCC1
InChI Key InChIKey=MVFQZFGSHLSESC-RUZDIDTESA-N
Data  1 KI
  Tab Delimited (TSV)   2D SDfile   Computed 3D by Vconf -m prep SDfile
Find this compound or compounds like it in BindingDB:
Activity Spreadsheet -- Enzyme Inhibition Constant Data from BindingDB
Found 1 hit for monomerid = 123070
TargetC-C chemokine receptor type 3(Homo sapiens (Human))
Boehringer Ingelheim International
US Patent
LigandPNGBDBM123070(US8742115, 9)
Affinity DataKi:  0.900nM. Assay description: The CCR3 receptor binding assay was performed in a Scintillation Proximity Assay (SPA) design with the radioligand recombinant human 125Iodine-eotaxi...
In DepthDetails US Patent