BDBM123842 US8748608, 16
SMILES OC(CCNC(=O)c1ccc(cc1)-c1ccccn1)CN1CCN(CC1)c1cccc(Cl)c1Cl
InChI Key InChIKey=JTJUCUMXKUPFBQ-UHFFFAOYSA-N
Data  1 KI  2 IC50
  Tab Delimited (TSV)   2D SDfile   Computed 3D by Vconf -m prep SDfile
Find this compound or compounds like it in BindingDB:
Activity Spreadsheet -- Enzyme Inhibition Constant Data from BindingDB
Found 2 hits for monomerid = 123842
TargetD(3) dopamine receptor(Homo sapiens (Human))
The United States Of America As Represented By The Secretary Of The Department Of Health And Human Services
US Patent
LigandPNGBDBM123842(US8748608, 16)
Affinity DataKi:  3nM IC50:  1nM. Assay description: Methods for performing in vitro dopamine receptor binding studies are described in Huang et al. J. Med. Chem. 44:1815-1826 (2001) and Luedtke et al. ...
In DepthDetails US Patent
TargetD(2) dopamine receptor(Homo sapiens (Human))
The United States Of America As Represented By The Secretary Of The Department Of Health And Human Services
US Patent
LigandPNGBDBM123842(US8748608, 16)
Affinity DataIC50:  15.8nMT: 2°C. Assay description: To measure D2 and D3 stimulation of mitogenesis (agonist assay) or D2 and D3 inhibition of quinpirole stimulation of mitogenesis (antagonist assay), ...
In DepthDetails US Patent