BDBM13030 7-sulfonamide-THIQ 20::CHEMBL177861::N-ethyl-3-(fluoromethyl)-1,2,3,4-tetrahydroisoquinoline-7-sulfonamide
SMILES CCNS(=O)(=O)c1ccc2CC(CF)NCc2c1
InChI Key InChIKey=UKWVXNMBQJTJOS-UHFFFAOYSA-N
Data  5 KI
  Tab Delimited (TSV)   2D SDfile   Computed 3D by Vconf -m prep SDfile
Find this compound or compounds like it in BindingDB:
Activity Spreadsheet -- Enzyme Inhibition Constant Data from BindingDB
Found 5 hits for monomerid = 13030
TargetPhenylethanolamine N-methyltransferase(Homo sapiens (Human))
University Of Kansas
LigandPNGBDBM13030(7-sulfonamide-THIQ 20 | CHEMBL177861 | N-ethyl-3-(...)
Affinity DataKi:  1.40E+3nM ΔG°:  -8.30kcal/molepH: 8.0 T: 2°C. Assay description: Enzyme activity is determined by measuring the amount of 3H incorporated into the substrate during the reaction. AdoMet/[methyl-3H]AdoMet serves as a...
In DepthDetails ArticlePubMed
TargetPhenylethanolamine N-methyltransferase(Homo sapiens (Human))
University Of Kansas
LigandPNGBDBM13030(7-sulfonamide-THIQ 20 | CHEMBL177861 | N-ethyl-3-(...)
Affinity DataKi:  1.40E+3nM. Assay description: Inhibition of [3H]-methyl-AdoMet binding to human phenylethnolamine N-methyltransferase expressed in E. coli BL21
In DepthDetails ArticlePubMed
TargetPhenylethanolamine N-methyltransferase(Homo sapiens (Human))
University Of Kansas
LigandPNGBDBM13030(7-sulfonamide-THIQ 20 | CHEMBL177861 | N-ethyl-3-(...)
Affinity DataKi:  1.40E+3nM. Assay description: In vitro binding affinity against recombinant human Phenylethanolamine N-methyltransferase expressed in E. coli using [methyl-3H]-AdoMet
In DepthDetails ArticlePubMed
TargetPhenylethanolamine N-methyltransferase(Homo sapiens (Human))
University Of Kansas
LigandPNGBDBM13030(7-sulfonamide-THIQ 20 | CHEMBL177861 | N-ethyl-3-(...)
Affinity DataKi:  1.40E+3nM. Assay description: In vitro binding affinity against human phenylethanolamine N-Methyltransferase
In DepthDetails ArticlePubMed
TargetAlpha-2A adrenergic receptor [16-465](Rattus norvegicus (rat))
University Of Kansas
Curated by ChEMBL
LigandPNGBDBM13030(7-sulfonamide-THIQ 20 | CHEMBL177861 | N-ethyl-3-(...)
Affinity DataKi:  5.50E+5nM. Assay description: In vitro binding affinity against rat Alpha-2 adrenergic receptor using [3H]-clonidine
In DepthDetails ArticlePubMed