BDBM131735 US8829193, 9
SMILES N[C@H]1C[C@H](O)CN(C1)c1ccncc1NC(=O)c1csc(n1)-c1c(F)cccc1F
InChI Key InChIKey=PRLYAWMVWDZNRR-RYUDHWBXSA-N
Data  3 IC50
  Tab Delimited (TSV)   2D SDfile   Computed 3D by Vconf -m prep SDfile
Find this compound or compounds like it in BindingDB:
Activity Spreadsheet -- Enzyme Inhibition Constant Data from BindingDB
Found 3 hits for monomerid = 131735
TargetSerine/threonine-protein kinase pim-1(Homo sapiens (Human))
Novartis
US Patent
LigandPNGBDBM131735(US8829193, 9)
Affinity DataIC50:  69nMpH: 7.5Assay Description:The activity of PIM1 is measured using a luciferase-luciferin based ATP detection reagent to quantify ATP depletion resulting from kinase-catalyzed p...
In DepthDetails US Patent
TargetSerine/threonine-protein kinase pim-3(Homo sapiens (Human))
Novartis
US Patent
LigandPNGBDBM131735(US8829193, 9)
Affinity DataIC50:  91nMpH: 7.5Assay Description:The activity of PIM3 is measured using a luciferase-luciferin based ATP detection reagent to quantify ATP depletion resulting from kinase-catalyzed p...
In DepthDetails US Patent
TargetSerine/threonine-protein kinase pim-2(Homo sapiens (Human))
Novartis
US Patent
LigandPNGBDBM131735(US8829193, 9)
Affinity DataIC50:  1.50E+3nMpH: 7.5Assay Description:The activity of PIM2 is measured using a luciferase-luciferin based ATP detection reagent to quantify ATP depletion resulting from kinase-catalyzed p...
In DepthDetails US Patent