BDBM136356 US8859534, 42
SMILES CN(C)C(=O)c1cc2cccc(N3CCN(CCc4cccc(n4)C(F)(F)F)CC3)c2o1
InChI Key InChIKey=KIBCJAHEQRCNSO-UHFFFAOYSA-N
Data  2 KI
  Tab Delimited (TSV)   2D SDfile   Computed 3D by Vconf -m prep SDfile
Find this compound or compounds like it in BindingDB:
Activity Spreadsheet -- Enzyme Inhibition Constant Data from BindingDB
Found 2 hits for monomerid = 136356
Target5-hydroxytryptamine receptor 1A(Cricetulus griseus (Chinese hamster) (Cricetulus b...)
Acturum Life Science
US Patent
LigandPNGBDBM136356(US8859534, 42)
Affinity DataKi:  0.640nMpH: 7.4Assay Description:Assays that were used to measure affinity of the compounds of the present invention for 5-HT1A and 5-HT1B receptors are described in J. Recept Signal...
In DepthDetails US Patent
Target5-hydroxytryptamine receptor 1B(Cricetulus griseus (Chinese hamster) (Cricetulus b...)
Acturum Life Science
US Patent
LigandPNGBDBM136356(US8859534, 42)
Affinity DataKi:  7nMpH: 7.4Assay Description:Assays that were used to measure affinity of the compounds of the present invention for 5-HT1A and 5-HT1B receptors are described in J. Recept Signal...
In DepthDetails US Patent