BDBM141919 US8921559, 9
SMILES NC(=O)C(NC1CCC(CC1)c1c[nH]c2ccccc12)C1CCN(CC1)C(=O)Nc1ccc(cc1)C(F)(F)F
InChI Key
Data  1 IC50
  Tab Delimited (TSV)   2D SDfile   Computed 3D by Vconf -m prep SDfile
Find this compound or compounds like it in BindingDB:
Activity Spreadsheet -- Enzyme Inhibition Constant Data from BindingDB
Found 1 hit for monomerid = 141919
TargetC-C chemokine receptor type 2(Homo sapiens (Human))
Janssen Pharmaceutica
US Patent
LigandPNGBDBM141919(US8921559, 9)
Affinity DataIC50:  130nMT: 2°C. Assay description: MCP-1 Receptor Binding Assay in THP-1 Cells Human monocytic cell line THP-1 cells were obtained from American Type Culture Collection (Manassas, Va.,...
In DepthDetails US Patent