BDBM14406 5-(5-Acetyl-2-isobutoxy-3-pyridinyl)-3-ethyl-2-(1-methyl-3-azetidinyl)-2,6-dihydro-7H-pyrazolo[4,3-d]pyrimidin-7-one::5-[5-acetyl-2-(2-methylpropoxy)pyridin-3-yl]-3-ethyl-2-(1-methylazetidin-3-yl)-2H,6H,7H-pyrazolo[4,3-d]pyrimidin-7-one::Sildenafil 5-methyl ketone analogue 30
SMILES CCc1n(nc2c1nc([nH]c2=O)-c1cc(cnc1OCC(C)C)C(C)=O)C1CN(C)C1
InChI Key InChIKey=RGQBMDVLKYPCTO-UHFFFAOYSA-N
Data  1 IC50
  Tab Delimited (TSV)   2D SDfile   Computed 3D by Vconf -m prep SDfile
Find this compound or compounds like it in BindingDB:
Activity Spreadsheet -- Enzyme Inhibition Constant Data from BindingDB
Found 1 hit for monomerid = 14406
TargetcGMP-specific 3',5'-cyclic phosphodiesterase(Homo sapiens (Human))
Pfizer
LigandPNGBDBM14406(5-(5-Acetyl-2-isobutoxy-3-pyridinyl)-3-ethyl-2-(1-...)
Affinity DataIC50:  8.20nM. Assay description: PDE5 or PDE6 catalytic activity was monitored by measuring the hydrolysis of [3H]-cGMP to [3H]-GMP using a scintillation proximity assay (SPA). [3H]-...
In DepthDetails ArticlePubMed