BDBM14414 5-[5-Acetyl-2-(2-methoxyethoxy)-3-pyridinyl]-3-ethyl-2-[2-(4-morpholinyl)ethyl]-2,6-dihydro-7H-pyrazolo[4,3-d]pyrimidin-7-one::5-[5-acetyl-2-(2-methoxyethoxy)pyridin-3-yl]-3-ethyl-2-[2-(morpholin-4-yl)ethyl]-2H,6H,7H-pyrazolo[4,3-d]pyrimidin-7-one::Sildenafil 5-methyl ketone analogue 17
SMILES CCc1n(CCN2CCOCC2)nc2c1nc([nH]c2=O)-c1cc(cnc1OCCOC)C(C)=O
InChI Key InChIKey=ZEDUDRXUCRVYAH-UHFFFAOYSA-N
Data  1 IC50
  Tab Delimited (TSV)   2D SDfile   Computed 3D by Vconf -m prep SDfile
Find this compound or compounds like it in BindingDB:
Activity Spreadsheet -- Enzyme Inhibition Constant Data from BindingDB
Found 1 hit for monomerid = 14414
TargetcGMP-specific 3',5'-cyclic phosphodiesterase(Homo sapiens (Human))
Pfizer
LigandPNGBDBM14414(5-[5-Acetyl-2-(2-methoxyethoxy)-3-pyridinyl]-3-eth...)
Affinity DataIC50:  53nM. Assay description: PDE5 or PDE6 catalytic activity was monitored by measuring the hydrolysis of [3H]-cGMP to [3H]-GMP using a scintillation proximity assay (SPA). [3H]-...
In DepthDetails ArticlePubMed