BDBM144352 US8969358, 103
SMILES CO[C@]12CC[C@@]3(C[C@@H]1CNC(=O)[C@H](C)N)[C@H]1Cc4ccc(O)c5O[C@@H]2[C@]3(CCN1CC1CC1)c45
InChI Key InChIKey=BXFODYODQXVPDM-ZLQRJZPTSA-N
Data  1 KI
  Tab Delimited (TSV)   2D SDfile   Computed 3D by Vconf -m prep SDfile
Find this compound or compounds like it in BindingDB:
Activity Spreadsheet -- Enzyme Inhibition Constant Data from BindingDB
Found 1 hit for monomerid = 144352
TargetKappa-type opioid receptor(Homo sapiens (Human))
Purdue Pharma
US Patent
LigandPNGBDBM144352(US8969358, 103)
Affinity DataKi:  0.140nM ΔG°:  -12.5kcal/molepH: 7.4 T: 2°C. Assay description: Kippa-Opioid Receptor Binding Assay Procedures: Membranes from recombinant HEK-293 cells expressing the human kippa opioid receptor (kippa) (cloned i...
In DepthDetails US Patent