BDBM14462 (-)-4-(3,10-Dibromo-8-chloro-6,11-dihydro-5H-benzo-[5,6]cyclohepta[1,2-b]pyridin-11(S)-yl)-4-(4-pyridinyl-acetyl)piperazine N4-Oxide::4-(2-{4-[(2S)-6,15-dibromo-13-chloro-4-azatricyclo[9.4.0.0^{3,8}]pentadeca-1(11),3,5,7,12,14-hexaen-2-yl]piperazin-1-yl}-2-oxoethyl)-1-oxidopyridin-1-ium::Trihalobenzocycloheptapyridine Tricyclic Compound 34
SMILES [O-][n+]1ccc(CC(=O)N2CCN(CC2)[C@@H]2c3ncc(Br)cc3CCc3cc(Cl)cc(Br)c23)cc1
InChI Key InChIKey=RKNQPYFCXGJISA-VWLOTQADSA-N
Data  1 IC50
  Tab Delimited (TSV)   2D SDfile   Computed 3D by Vconf -m prep SDfile
Find this compound or compounds like it in BindingDB:
Activity Spreadsheet -- Enzyme Inhibition Constant Data from BindingDB
Found 1 hit for monomerid = 14462
TargetProtein farnesyltransferase subunit beta/geranylgeranyltransferase type-1 subunit alpha(Homo sapiens (Human))
Schering-Plough Research Institute
LigandPNGBDBM14462((-)-4-(3,10-Dibromo-8-chloro-6,11-dihydro-5H-benzo...)
Affinity DataIC50: >95nMpH: 7.5 T: 2°C. Assay description: FPT activity was determined by measuring transfer of [3H] farnesyl from [3H]farnesyl pyrophosphate to the substrate His6-Ha-Ras-CVLS. The incorporate...
In DepthDetails ArticlePubMed