BDBM14960 (R)-5-(2-(2-Aminopyrimidin-5-yl)ethynyl)-N-(2-(3-(dimethylamino)piperidin-1-yl)-5-(trifluoromethyl)phenyl)-2-fluorobenzamide::5-[2-(2-aminopyrimidin-5-yl)ethynyl]-N-{2-[(3R)-3-(dimethylamino)piperidin-1-yl]-5-(trifluoromethyl)phenyl}-2-fluorobenzamide::alkynylpyrimidine amide 6k
SMILES CN(C)[C@@H]1CCCN(C1)c1ccc(cc1NC(=O)c1cc(ccc1F)C#Cc1cnc(N)nc1)C(F)(F)F
InChI Key InChIKey=GMVQPWCWWLPOQT-HXUWFJFHSA-N
Data  3 IC50
  Tab Delimited (TSV)   2D SDfile   Computed 3D by Vconf -m prep SDfile
Find this compound or compounds like it in BindingDB:
Activity Spreadsheet -- Enzyme Inhibition Constant Data from BindingDB
Found 3 hits for monomerid = 14960
TargetAngiopoietin-1 receptor(Homo sapiens (Human))
Amgen
LigandPNGBDBM14960((R)-5-(2-(2-Aminopyrimidin-5-yl)ethynyl)-N-(2-(3-(...)
Affinity DataIC50:  44nMpH: 7.5 T: 2°C. Assay description: The assay uses purified enzyme interacting with biotinylated peptide substrate. HTRF is based on the proximity of europium cryptate (donor fluorophor...
In DepthDetails ArticlePubMed
TargetTyrosine-protein kinase Lck [245-498](Homo sapiens (Human))
Amgen
LigandPNGBDBM14960((R)-5-(2-(2-Aminopyrimidin-5-yl)ethynyl)-N-(2-(3-(...)
Affinity DataIC50:  780nM. Assay description: The assay uses purified enzyme interacting with biotinylated peptide substrate. HTRF is based on the proximity of europium cryptate (donor fluorophor...
In DepthDetails ArticlePubMed
TargetVascular endothelial growth factor receptor 2(Homo sapiens (Human))
Amgen
LigandPNGBDBM14960((R)-5-(2-(2-Aminopyrimidin-5-yl)ethynyl)-N-(2-(3-(...)
Affinity DataIC50:  810nM. Assay description: The assay uses purified enzyme interacting with biotinylated peptide substrate. HTRF is based on the proximity of europium cryptate (donor fluorophor...
In DepthDetails ArticlePubMed