BDBM150481 US10238633, Example 155::US8987249, 155::US9713606, 155
SMILES CN1CCN(CC1)S(=O)(=O)c1ccc(cc1)-c1ccc(C[C@H](NC(=O)[C@H]2N[C@@H]3CC[C@H]2C3)C#N)c(F)c1
InChI Key InChIKey=JTEJDGCXJPQUEE-LNEBKTTKSA-N
Data  5 IC50
  Tab Delimited (TSV)   2D SDfile   Computed 3D by Vconf -m prep SDfile
Find this compound or compounds like it in BindingDB:
Activity Spreadsheet -- Enzyme Inhibition Constant Data from BindingDB
Found 5 hits for monomerid = 150481
TargetDipeptidyl peptidase 1(Homo sapiens (Human))
Boehringer Ingelheim International
US Patent
LigandPNGBDBM150481(US10238633, Example 155 | US8987249, 155 | US97136...)
Affinity DataIC50:  0.800nMT: 2°C. Assay description: The recombinant human DPPI was diluted in TAGZyme buffer to 1 U/ml (38.1 ug/ml, respectively), and then activated by mixing in a 1:2 ratio with a Cys...
In DepthDetails US Patent
TargetDipeptidyl peptidase 1(Homo sapiens (Human))
Boehringer Ingelheim International
US Patent
LigandPNGBDBM150481(US10238633, Example 155 | US8987249, 155 | US97136...)
Affinity DataIC50:  0.800nMpH: 6.0 T: 2°C. Assay description: Materials: Microtiterplates (Optiplate-384 F) were purchased from PerkinElmer (Prod. No. 6007270). The substrate Gly-Arg-AMC was from Biotrend (Prod....
In DepthDetails US Patent
TargetCathepsin K(Homo sapiens (Human))
Boehringer Ingelheim International
US Patent
LigandPNGBDBM150481(US10238633, Example 155 | US8987249, 155 | US97136...)
Affinity DataIC50:  1.00E+3nM. Assay description: To activate the proenzyme, 5 μl procathepsin K were mixed with 1 ul activation buffer, and incubated at room temperature for 30 min.5 μL te...
In DepthDetails US Patent
TargetDipeptidyl peptidase 1(Homo sapiens (Human))
Boehringer Ingelheim International
US Patent
LigandPNGBDBM150481(US10238633, Example 155 | US8987249, 155 | US97136...)
Affinity DataIC50:  0.800nM. Assay description: The recombinant human DPPI was diluted in TAGZyme buffer to 1 U/ml (38.1 μg/ml, respectively), and then activated by mixing in a 1:2 ratio with ...
In DepthDetails US Patent
TargetCathepsin K(Homo sapiens (Human))
Boehringer Ingelheim International
US Patent
LigandPNGBDBM150481(US10238633, Example 155 | US8987249, 155 | US97136...)
Affinity DataIC50:  1.00E+3nMpH: 3.5 T: 2°C. Assay description: Materials: Microtiterplates (Optiplate-384 F were purchased from PerkinElmer (Prod. No. 6007270). The substrate Z-Gly-Pro-Arg-AMC was from Biomol (Pr...
In DepthDetails US Patent