BDBM150618 US10238633, Example 292::US8987249, 292::US9713606, 292
SMILES Fc1cc2c3ccc(cc3[nH]c(=O)c2cc1CC(NC(=O)[C@H]1N[C@@H]2CC[C@H]1C2)C#N)C#N
InChI Key
Data  3 IC50
  Tab Delimited (TSV)   2D SDfile   Computed 3D by Vconf -m prep SDfile
Find this compound or compounds like it in BindingDB:
Activity Spreadsheet -- Enzyme Inhibition Constant Data from BindingDB
Found 3 hits for monomerid = 150618
TargetDipeptidyl peptidase 1(Homo sapiens (Human))
Boehringer Ingelheim International
US Patent
LigandPNGBDBM150618(US10238633, Example 292 | US8987249, 292 | US97136...)
Affinity DataIC50:  0.900nMT: 2°C. Assay description: The recombinant human DPPI was diluted in TAGZyme buffer to 1 U/ml (38.1 ug/ml, respectively), and then activated by mixing in a 1:2 ratio with a Cys...
In DepthDetails US Patent
TargetDipeptidyl peptidase 1(Homo sapiens (Human))
Boehringer Ingelheim International
US Patent
LigandPNGBDBM150618(US10238633, Example 292 | US8987249, 292 | US97136...)
Affinity DataIC50:  0.900nM. Assay description: The recombinant human DPPI was diluted in TAGZyme buffer to 1 U/ml (38.1 μg/ml, respectively), and then activated by mixing in a 1:2 ratio with ...
In DepthDetails US Patent
TargetDipeptidyl peptidase 1(Homo sapiens (Human))
Boehringer Ingelheim International
US Patent
LigandPNGBDBM150618(US10238633, Example 292 | US8987249, 292 | US97136...)
Affinity DataIC50:  0.900nMpH: 6.0 T: 2°C. Assay description: Materials: Microtiterplates (Optiplate-384 F) were purchased from PerkinElmer (Prod. No. 6007270). The substrate Gly-Arg-AMC was from Biotrend (Prod....
In DepthDetails US Patent