BDBM150927 US8981106, 116
SMILES Fc1ccc(NC(=O)c2ccc(SCC(=O)c3ccco3)nc2)cc1
InChI Key InChIKey=BBICXYFZZZDNIR-UHFFFAOYSA-N
Data  1 IC50
  Tab Delimited (TSV)   2D SDfile   Computed 3D by Vconf -m prep SDfile
Find this compound or compounds like it in BindingDB:
Activity Spreadsheet -- Enzyme Inhibition Constant Data from BindingDB
Found 1 hit for monomerid = 150927
TargetC-X-C chemokine receptor type 2(Homo sapiens (Human))
Syntrix Biosystems
US Patent
LigandPNGBDBM150927(US8981106, 116)
Affinity DataIC50: >1.00E+4nMT: 2°C. Assay description: An in vitro assay showed inhibition of CXCR2-mediated intracellular calcium release. Briefly, human neutrophils were suspended in HBSS- (without Ca2+...
In DepthDetails US Patent