BDBM15638 4-(4-(3-Chlorophenyl)-1H-pyrazol-3-yl)-N-(1-(4-chlorophenyl)-2-hydroxyethyl)-1H-pyrrole-2-carboxamide::4-[4-(3-chlorophenyl)-1H-pyrazol-3-yl]-N-[1-(4-chlorophenyl)-2-hydroxyethyl]-1H-pyrrole-2-carboxamide::Pyrrole Carboxamide Analog 6i
SMILES OCC(NC(=O)c1cc(c[nH]1)-c1n[nH]cc1-c1cccc(Cl)c1)c1ccc(Cl)cc1
InChI Key InChIKey=IBZYAAWMHJTHPC-UHFFFAOYSA-N
Data  2 KI
  Tab Delimited (TSV)   2D SDfile   Computed 3D by Vconf -m prep SDfile
Find this compound or compounds like it in BindingDB:
Activity Spreadsheet -- Enzyme Inhibition Constant Data from BindingDB
Found 2 hits for monomerid = 15638
TargetMitogen-activated protein kinase 1(Homo sapiens (Human))
Vertex Pharmaceuticals
LigandPNGBDBM15638(4-(4-(3-Chlorophenyl)-1H-pyrazol-3-yl)-N-(1-(4-chl...)
Affinity DataKi:  14nM. Assay description: A coupled spectrophotometric assay was used in which ADP generated by ERK2 was converted to ATP by pyruvate kinase with the production of pyruvate fr...
In DepthDetails ArticlePubMed
TargetMitogen-activated protein kinase 10(Homo sapiens (Human))
Vertex Pharmaceuticals
LigandPNGBDBM15638(4-(4-(3-Chlorophenyl)-1H-pyrazol-3-yl)-N-(1-(4-chl...)
Affinity DataKi:  2.50E+3nM. Assay description: A coupled spectrophotometric assay was used in which ADP generated by JNK3 was converted to ATP by pyruvate kinase with the production of pyruvate fr...
In DepthDetails ArticlePubMed